Target
Dimer of Gag-Pol polyprotein [491-589,Q498K,L501I,V555I,A562V,G564S,I575V,L581M]
Ligand
BDBM520
Substrate
HIV-1 Protease Substrate
Meas. Tech.
Enzyme Inhibition Assay
Ki
2.81±n/a nM
Citation
 Reddy, GSAli, ANalam, MNAnjum, SGCao, HNathans, RSSchiffer, CARana, TM Design and Synthesis of HIV-1 Protease Inhibitors Incorporating Oxazolidinones as P2/P2' Ligands in Pseudosymmetric Dipeptide Isosteres. J Med Chem 50:4316-28 (2007)  
Target
Name:
Dimer of Gag-Pol polyprotein [491-589,Q498K,L501I,V555I,A562V,G564S,I575V,L581M]
Synonyms:
HIV-1 Protease Mutant M3 (L10I, L63P, A71V, G73S, I84V, L90M)
Type:
Protein Complex
Mol. Mass.:
Description:
Components:
This complex has 2 components.
Component 1
Name:
Gag-Pol polyprotein [491-589,Q498K,L501I,V555I,A562V,G564S,I575V,L581M]
Synonyms:
HIV-1 Protease Mutant M3 (Q7K,L10I, V64I, A71V, G73S, I84V, L90M) chain A POL_HV1A2 | gag-pol
Type:
Enzyme Subunit
Mol. Mass.:
10869.31
Organism:
Human immunodeficiency virus type 1
Description:
O38732 mutant
Residue:
99
  
Component 2
Name:
Gag-Pol polyprotein [491-589,Q498K,L501I,V555I,A562V,G564S,I575V,L581M]
Synonyms:
HIV-1 Protease Mutant M3 (Q7K,L10I, V64I, A71V, G73S, I84V, L90M) chain A POL_HV1A2 | gag-pol
Type:
Enzyme Subunit
Mol. Mass.:
10869.31
Organism:
Human immunodeficiency virus type 1
Description:
O38732 mutant
Residue:
99
  
Inhibitor
Name:
BDBM520
Synonyms:
1,3-thiazol-5-ylmethyl N-[(2S,3S,5S)-3-hydroxy-5-[(2S)-3-methyl-2-{[methyl({[2-(propan-2-yl)-1,3-thiazol-4-yl]methyl})carbamoyl]amino}butanamido]-1,6-diphenylhexan-2-yl]carbamate CHEMBL163 RTV | Ritonavir
Type:
Small organic molecule
Emp. Form.:
C37H48N6O5S2
Mol. Mass.:
720.944
SMILES:
CC(C)[C@H](NC(=O)N(C)Cc1csc(n1)C(C)C)C(=O)N[C@H](C[C@H](O)[C@H](Cc1ccccc1)NC(=O)OCc1cncs1)Cc1ccccc1
:
Substrate
Name:
HIV-1 Protease Substrate
Synonyms:
Type:
Peptide
Mol. Mass.:
4728.18
Organism:
Description:
Residue:
44