Target
Isoleucine--tRNA ligase
Ligand
BDBM18156
Substrate
BDBM18140
Meas. Tech.
Competitive Ligand Binding Assay
pH
7.5±n/a
Temperature
293.15±n/a K
Ki
16666667±8333333 nM
Citation
 Flossdorf, JPratorius, HJKula, MR Influence of side-chain structure of aliphatic amino acids on binding to isoleucyl-tRNA synthetase from Escherichia coli MRE 600. Eur J Biochem 66:147-55 (1976)  
Target
Name:
Isoleucine--tRNA ligase
Synonyms:
Isoleucine--tRNA ligase ileS tRNA synthetase (IleRS)
Type:
Enzyme
Mol. Mass.:
104286.05
Organism:
Escherichia coli
Description:
Residue:
938
  
Inhibitor
Name:
BDBM18156
Synonyms:
(3R)-2-amino-3-methylheptanoic acid | DL-2-Amino-3R-methyl heptanoic acid
Type:
Small organic molecule
Emp. Form.:
C8H17NO2
Mol. Mass.:
159.2261
SMILES:
CCCC[C@@H](C)C(N)C(O)=O
:
Substrate
Name:
BDBM18140
Synonyms:
(2S,3S)-2-amino-3-methylpentanoic acid L-[14C]Isoleucine
Type:
Amino Acid
Emp. Form.:
C6H13NO2
Mol. Mass.:
131.1729
SMILES:
CC[C@H](C)[C@H](N)C(O)=O
: