Target
Bifunctional dihydrofolate reductase-thymidylate synthase
Ligand
BDBM18244
Substrate
BDBM18044
Meas. Tech.
Determination of IC50
IC50
5.8±n/a nM
Citation
 Chan, DCFu, HForsch, RAQueener, SFRosowsky, A Design, synthesis, and antifolate activity of new analogues of piritrexim and other diaminopyrimidine dihydrofolate reductase inhibitors with omega-carboxyalkoxy or omega-carboxy-1-alkynyl substitution in the side chain. J Med Chem 48:4420-31 (2005)  
Target
Name:
Bifunctional dihydrofolate reductase-thymidylate synthase
Synonyms:
DHFR-TS Dihydrofolate reductase Dihydrofolate reductase; T. gondii vs rat
Type:
Enzyme
Mol. Mass.:
68757.49
Organism:
Toxoplasma gondii
Description:
Q07422
Residue:
610
  
Inhibitor
Name:
BDBM18244
Synonyms:
6-[(2-iodo-5-methoxyphenyl)methyl]-5-methylpyrido[2,3-d]pyrimidine-2,4-diamine | Piritrexim analogue, 56
Type:
Small organic molecule
Emp. Form.:
C16H16IN5O
Mol. Mass.:
421.2356
SMILES:
COc1ccc(I)c(Cc2cnc3nc(N)nc(N)c3c2C)c1
:
Substrate
Name:
BDBM18044
Synonyms:
(2S)-2-[(4-{[(2-amino-4-oxo-1,4,7,8-tetrahydropteridin-6-yl)methyl]amino}phenyl)formamido]pentanedioic acid dihydrofolic acid
Type:
Small organic molecule
Emp. Form.:
C19H21N7O6
Mol. Mass.:
443.4133
SMILES:
Nc1nc2NCC(CNc3ccc(cc3)C(=O)N[C@@H](CCC(O)=O)C(O)=O)=Nc2c(=O)[nH]1
: