Target
Lysosomal acid glucosylceramidase
Ligand
BDBM18362
Substrate
BDBM18352
Meas. Tech.
In Vitro Enzyme Inhibition
pH
5.5±n/a
Temperature
310.15±n/a K
Ki
2300±n/a nM
IC50
4200±n/a nM
Comments
Competitive inhibition.
Citation
 Yu, LIkeda, KKato, AAdachi, IGodin, GCompain, PMartin, OAsano, N Alpha-1-C-octyl-1-deoxynojirimycin as a pharmacological chaperone for Gaucher disease. Bioorg Med Chem 14:7736-44 (2006)  
Target
Name:
Lysosomal acid glucosylceramidase
Synonyms:
Acid beta-glucosidase Beta-glucocerebrosidase D-glucosyl-N-acylsphingosine glucohydrolase GBA1 GC GLUC Glucosylceramidase (GBA) Glucosylceramidase precursor (Beta-glucocerebrosidase) (Acid beta-glucosidase) (D-glucosyl-N-acylsphingosine glucohydrolase) (Alglucerase) (Imiglucerase) beta-glucocerebrosidase (GCase)
Type:
Enzyme
Mol. Mass.:
59724.64
Organism:
Homo sapiens (Human)
Description:
The beta-Glu activity was measured with commercially available beta-glucocerebrosidase (Ceredase) as the enzyme source.
Residue:
536
  
Inhibitor
Name:
BDBM18362
Synonyms:
(2R,3S,4R,5R,6R)-2-hexyl-6-(hydroxymethyl)piperidine-3,4,5-triol | alpha-1-C-Hexyl-DNJ
Type:
Small organic molecule
Emp. Form.:
C12H25NO4
Mol. Mass.:
247.3312
SMILES:
CCCCCC[C@H]1N[C@H](CO)[C@@H](O)[C@H](O)[C@H]1O
:
Substrate
Name:
BDBM18352
Synonyms:
4-Methylumbelliferyl beta-D-glucopyranoside 4-methylumbelliferyl beta-D-glucoside | MUD
Type:
Small organic molecule
Emp. Form.:
C16H18O8
Mol. Mass.:
338.3093
SMILES:
Cc1cc(=O)oc2cc(O[C@@H]3O[C@H](CO)[C@@H](O)[C@H](O)[C@H]3O)ccc12
: