Target
Protein-lysine 6-oxidase
Ligand
BDBM18364
Substrate
BDBM18365
Meas. Tech.
In Vitro Enzyme Inhibition
pH
4.5±n/a
Temperature
310.15±n/a K
IC50
4800±n/a nM
Citation
 Yu, LIkeda, KKato, AAdachi, IGodin, GCompain, PMartin, OAsano, N Alpha-1-C-octyl-1-deoxynojirimycin as a pharmacological chaperone for Gaucher disease. Bioorg Med Chem 14:7736-44 (2006)  
Target
Name:
Protein-lysine 6-oxidase
Synonyms:
LOX Lysyl oxidase | alpha-Glucosidase (alpha-Glu)
Type:
PROTEIN
Mol. Mass.:
46954.13
Organism:
Homo sapiens (Human)
Description:
ChEMBL_306619
Residue:
417
  
Inhibitor
Name:
BDBM18364
Synonyms:
(2R,3R,4R,5S,6R)-2-(hydroxymethyl)-6-nonylpiperidine-3,4,5-triol US9181184, 32 | alpha-1-C-Nonyl-DNJ
Type:
Small organic molecule
Emp. Form.:
C15H31NO4
Mol. Mass.:
289.4109
SMILES:
CCCCCCCCC[C@H]1N[C@H](CO)[C@@H](O)[C@H](O)[C@H]1O
:
Substrate
Name:
BDBM18365
Synonyms:
4-Methylumbelliferyl alpha-D-glucopyranoside 4-methylumbelliferyl alpha-glucoside
Type:
Small organic molecule
Emp. Form.:
C16H18O8
Mol. Mass.:
338.3093
SMILES:
Cc1cc(=O)oc2cc(O[C@H]3O[C@H](CO)[C@@H](O)[C@H](O)[C@H]3O)ccc12
: