Target
Apelin receptor
Ligand
BDBM360102
Substrate
Meas. Tech.
[35S]GTPgammaS Binding Assay
EC50
13.0±n/a nM
Target
Name:
Apelin receptor
Synonyms:
AGTRL1 APJ_HUMAN Angiotensin receptor-like 1 Apelin receptor (APJ) G-protein coupled receptor HG11
Type:
Enzyme Catalytic Domain
Mol. Mass.:
42664.06
Organism:
Homo sapiens (Human)
Description:
P35414
Residue:
380
  
Inhibitor
Name:
BDBM360102
Synonyms:
(1S,2R)-N-(4-(2,6-dimethoxyphenyl)-5-(5-methyl-3-pyridinyl)-4H-1,2,4-triazol-3- | US10221162, Example 398.0
Type:
Small organic molecule
Emp. Form.:
C28H35N7O6S
Mol. Mass.:
597.686
SMILES:
COCCO[C@H]([C@@H](C)S(=O)(=O)N(C)c1nnc(-c2cncc(C)c2)n1-c1c(OC)cccc1OC)c1ncc(C)cn1
: