Target
Apelin receptor
Ligand
BDBM269884
Substrate
Meas. Tech.
[35S]GTPgammaS Binding Assay
EC50
0.260±n/a nM
Target
Name:
Apelin receptor
Synonyms:
AGTRL1 APJ_HUMAN Angiotensin receptor-like 1 Apelin receptor (APJ) G-protein coupled receptor HG11
Type:
Enzyme Catalytic Domain
Mol. Mass.:
42664.06
Organism:
Homo sapiens (Human)
Description:
P35414
Residue:
380
  
Inhibitor
Name:
BDBM269884
Synonyms:
(1S,2R)—N-(4-(2,6-dimethoxyphenyl)-5-(6-methoxypyridin-2-yl)-4H-1,2,4-triazol-3-yl)-1-(2-hydroxyethoxy)-1-(5-methylpyrimidin-2-yl)propane-2-sulfonamide or (1R,2S)—N-(4-(2,6-dimethoxyphenyl)-5-(6-methoxypyridin-2-yl)-4H-1,2,4-triazol-3-yl)-1-(2-hydroxyethoxy)-1-(5-methylpyrimidin-2-yl)propane-2-sulfonamide US10058550, Example 416.0 US9845310, Example 416.0
Type:
Small organic molecule
Emp. Form.:
C26H31N7O7S
Mol. Mass.:
585.632
SMILES:
COc1cccc(n1)-c1nnc(NS(=O)(=O)[C@@H](C)[C@H](OCCO)c2ncc(C)cn2)n1-c1c(OC)cccc1OC
: