Target
Apelin receptor
Ligand
BDBM360117
Substrate
Meas. Tech.
[35S]GTPgammaS Binding Assay
EC50
7.90±n/a nM
Target
Name:
Apelin receptor
Synonyms:
AGTRL1 APJ_HUMAN Angiotensin receptor-like 1 Apelin receptor (APJ) G-protein coupled receptor HG11
Type:
Enzyme Catalytic Domain
Mol. Mass.:
42664.06
Organism:
Homo sapiens (Human)
Description:
P35414
Residue:
380
  
Inhibitor
Name:
BDBM360117
Synonyms:
(2S)-N-(4-(2,6-dimethoxyphenyl)-5-(5-ethyl-3-pyridinyl)-4H-1,2,4-triazol-3-yl)-1-(5- US9845310, Example 420.0
Type:
Small organic molecule
Emp. Form.:
C24H26FN7O4S
Mol. Mass.:
527.571
SMILES:
CCc1cncc(c1)-c1nnc(NS(=O)(=O)[C@H](C)Cc2ncc(F)cn2)n1-c1c(OC)cccc1OC
: