Target
Apelin receptor
Ligand
BDBM360121
Substrate
Meas. Tech.
[35S]GTPgammaS Binding Assay
EC50
0.440±n/a nM
Target
Name:
Apelin receptor
Synonyms:
AGTRL1 APJ_HUMAN Angiotensin receptor-like 1 Apelin receptor (APJ) G-protein coupled receptor HG11
Type:
Enzyme Catalytic Domain
Mol. Mass.:
42664.06
Organism:
Homo sapiens (Human)
Description:
P35414
Residue:
380
  
Inhibitor
Name:
BDBM360121
Synonyms:
(1R,2S)-N-(4-(2,6-dimethoxyphenyl)-5-(6-methoxy-2-pyridinyl)-4H-1,2,4-triazol-3- | US10221162, Example 423.0
Type:
Small organic molecule
Emp. Form.:
C25H30N8O5S
Mol. Mass.:
554.621
SMILES:
CN[C@@H]([C@H](C)S(=O)(=O)Nc1nnc(-c2cccc(OC)n2)n1-c1c(OC)cccc1OC)c1ncc(C)cn1
: