Target
Apelin receptor
Ligand
BDBM360130
Substrate
Meas. Tech.
[35S]GTPgammaS Binding Assay
EC50
42.0±n/a nM
Target
Name:
Apelin receptor
Synonyms:
AGTRL1 APJ_HUMAN Angiotensin receptor-like 1 Apelin receptor (APJ) G-protein coupled receptor HG11
Type:
Enzyme Catalytic Domain
Mol. Mass.:
42664.06
Organism:
Homo sapiens (Human)
Description:
P35414
Residue:
380
  
Inhibitor
Name:
BDBM360130
Synonyms:
(2R,3S)-N-(4-(2,6-dimethoxyphenyl)-5-(6-methoxy-2-pyridinyl)-4H-1,2,4-triazol-3- | US10221162, Example 433.0
Type:
Small organic molecule
Emp. Form.:
C28H43N5O6SSi
Mol. Mass.:
605.821
SMILES:
COc1cccc(n1)-c1nnc(N(CC[Si](C)(C)C)S(=O)(=O)[C@@H](C)[C@H](O)C(C)(C)C)n1-c1c(OC)cccc1OC
: