Target
Apelin receptor
Ligand
BDBM360138
Substrate
Meas. Tech.
[35S]GTPgammaS Binding Assay
EC50
1.20±n/a nM
Target
Name:
Apelin receptor
Synonyms:
AGTRL1 APJ_HUMAN Angiotensin receptor-like 1 Apelin receptor (APJ) G-protein coupled receptor HG11
Type:
Enzyme Catalytic Domain
Mol. Mass.:
42664.06
Organism:
Homo sapiens (Human)
Description:
P35414
Residue:
380
  
Inhibitor
Name:
BDBM360138
Synonyms:
(1R,2R)-1-cyclohexyl-N-(4-(2,6-dimethoxyphenyl)-5-(6-methoxy-2-pyridinyl)-4H- | US10221162, Example 441.0
Type:
Small organic molecule
Emp. Form.:
C30H45N5O6SSi
Mol. Mass.:
631.859
SMILES:
COc1cccc(n1)-c1nnc(N(CC[Si](C)(C)C)S(=O)(=O)[C@@H](C)[C@H](O)C2CCCCC2)n1-c1c(OC)cccc1OC
: