Target
Apelin receptor
Ligand
BDBM269909
Substrate
Meas. Tech.
[35S]GTPgammaS Binding Assay
EC50
2.50±n/a nM
Target
Name:
Apelin receptor
Synonyms:
AGTRL1 APJ_HUMAN Angiotensin receptor-like 1 Apelin receptor (APJ) G-protein coupled receptor HG11
Type:
Enzyme Catalytic Domain
Mol. Mass.:
42664.06
Organism:
Homo sapiens (Human)
Description:
P35414
Residue:
380
  
Inhibitor
Name:
BDBM269909
Synonyms:
(1R,2S)-1-cyclohexyl-N-(4-(2,6-dimethoxyphenyl)-5-(6-methoxy-2-pyridinyl)-4H-1,2,4-triazol-3-yl)-1-hydroxy-2-propanesulfonamide or (1S,2R)-1-cyclohexyl-N-(4-(2,6-dimethoxyphenyl)-5-(6-methoxy-2-pyridinyl)-4H-1,2,4-triazol-3-yl)-1-hydroxy-2-propanesulfonamide US10058550, Example 443.0 US9845310, Example 443.0
Type:
Small organic molecule
Emp. Form.:
C25H33N5O6S
Mol. Mass.:
531.624
SMILES:
COc1cccc(n1)-c1nnc(NS(=O)(=O)[C@H](C)[C@@H](O)C2CCCCC2)n1-c1c(OC)cccc1OC
: