Target
Apelin receptor
Ligand
BDBM360141
Substrate
Meas. Tech.
[35S]GTPgammaS Binding Assay
EC50
80.0±n/a nM
Target
Name:
Apelin receptor
Synonyms:
AGTRL1 APJ_HUMAN Angiotensin receptor-like 1 Apelin receptor (APJ) G-protein coupled receptor HG11
Type:
Enzyme Catalytic Domain
Mol. Mass.:
42664.06
Organism:
Homo sapiens (Human)
Description:
P35414
Residue:
380
  
Inhibitor
Name:
BDBM360141
Synonyms:
(1R,2R)-N-(4-(2,6-dimethoxyphenyl)-5-(6-methoxy-2-pyridinyl)-4H-1,2,4-triazol-3- | US10221162, Example 444.0
Type:
Small organic molecule
Emp. Form.:
C29H43N5O7SSi
Mol. Mass.:
633.832
SMILES:
COc1cccc(n1)-c1nnc(N(CC[Si](C)(C)C)S(=O)(=O)[C@@H](C)[C@H](O)C2CCOCC2)n1-c1c(OC)cccc1OC
: