Target
Cytosolic arginine sensor for mTORC1 subunit 1
Ligand
BDBM315517
Substrate
Meas. Tech.
Inhibition Assay
IC50
>500±n/a nM
Citation
 Ren, PLiu, YLi, LChan, KWilson, TE Kinase inhibitors and methods of use US Patent  US9828378 Publication Date 11/28/2017 
Target
Name:
Cytosolic arginine sensor for mTORC1 subunit 1
Synonyms:
CAST1_HUMAN Cellular arginine sensor for mTORC1 protein 1 GATSL3 | mTORC1 protein 1
Type:
Protein
Mol. Mass.:
36264.36
Organism:
Homo sapiens (Human)
Description:
Q8WTX7
Residue:
329
  
Inhibitor
Name:
BDBM315517
Synonyms:
US10172858, Table 2.13 | US9828378, # 13
Type:
Small organic molecule
Emp. Form.:
C17H17ClN6O
Mol. Mass.:
356.809
SMILES:
COc1cc(Cl)c2[nH]c(cc2c1)-c1nn(C(C)C)c2ncnc(N)c12
: