Target
Cytosolic arginine sensor for mTORC1 subunit 1
Ligand
BDBM315575
Substrate
Meas. Tech.
Inhibition Assay
IC50
<100±n/a nM
Citation
 Ren, PLiu, YLi, LChan, KWilson, TE Kinase inhibitors and methods of use US Patent  US9828378 Publication Date 11/28/2017 
Target
Name:
Cytosolic arginine sensor for mTORC1 subunit 1
Synonyms:
CAST1_HUMAN Cellular arginine sensor for mTORC1 protein 1 GATSL3 | mTORC1 protein 1
Type:
Protein
Mol. Mass.:
36264.36
Organism:
Homo sapiens (Human)
Description:
Q8WTX7
Residue:
329
  
Inhibitor
Name:
BDBM315575
Synonyms:
US10172858, Table 2.71 | US9828378, # 71
Type:
Small organic molecule
Emp. Form.:
C21H24ClN7O
Mol. Mass.:
425.915
SMILES:
CC(C)N1CCC(CC1)n1nc(-c2cc3c(Cl)ccc(O)c3[nH]2)c2c(N)ncnc12
: