Target
Tyrosine-protein kinase JAK3
Ligand
BDBM362207
Substrate
IC50
5.5±n/a nM
Citation
 Xu, QSong, YPandey, A Pyridazine compounds as JAK inhibitors US Patent  US9834548 Publication Date 12/5/2017 
Target
Name:
Tyrosine-protein kinase JAK3
Synonyms:
JAK-3 JAK3_HUMAN Janus kinase 3 (JAK3) L-JAK | Leukocyte janus kinase
Type:
Protein
Mol. Mass.:
125111.08
Organism:
Homo sapiens (Human)
Description:
P52333
Residue:
1124
  
Inhibitor
Name:
BDBM362207
Synonyms:
US9834548, Example 19
Type:
Small organic molecule
Emp. Form.:
C24H26FN7O2
Mol. Mass.:
463.5073
SMILES:
CC(=O)N1CCN(CC1)c1ccc(Nc2cc(NCc3cccc(F)c3)c(nn2)C(N)=O)cc1
: