Target
Tyrosine-protein kinase JAK3
Ligand
BDBM362223
Substrate
IC50
5.5±n/a nM
Citation
 Xu, QSong, YPandey, A Pyridazine compounds as JAK inhibitors US Patent  US9834548 Publication Date 12/5/2017 
Target
Name:
Tyrosine-protein kinase JAK3
Synonyms:
JAK-3 JAK3_HUMAN Janus kinase 3 (JAK3) L-JAK | Leukocyte janus kinase
Type:
Protein
Mol. Mass.:
125111.08
Organism:
Homo sapiens (Human)
Description:
P52333
Residue:
1124
  
Inhibitor
Name:
BDBM362223
Synonyms:
US9834548, Example 31
Type:
Small organic molecule
Emp. Form.:
C25H27F2N7O2
Mol. Mass.:
495.5244
SMILES:
CCC(=O)N1CCN(CC1)c1ccc(Nc2cc(NCc3cc(F)cc(F)c3)c(nn2)C(N)=O)cc1
: