Target
Tyrosine-protein kinase JAK3
Ligand
BDBM362232
Substrate
IC50
55±n/a nM
Citation
 Xu, QSong, YPandey, A Pyridazine compounds as JAK inhibitors US Patent  US9834548 Publication Date 12/5/2017 
Target
Name:
Tyrosine-protein kinase JAK3
Synonyms:
JAK-3 JAK3_HUMAN Janus kinase 3 (JAK3) L-JAK | Leukocyte janus kinase
Type:
Protein
Mol. Mass.:
125111.08
Organism:
Homo sapiens (Human)
Description:
P52333
Residue:
1124
  
Inhibitor
Name:
BDBM362232
Synonyms:
US9834548, Example 38
Type:
Small organic molecule
Emp. Form.:
C22H22F2N6O2
Mol. Mass.:
440.4459
SMILES:
NC(=O)c1nnc(Nc2ccc(cc2)N2CCOCC2)cc1NCc1cccc(F)c1F
: