Target
Tyrosine-protein kinase JAK3
Ligand
BDBM362235
Substrate
IC50
55±n/a nM
Citation
 Xu, QSong, YPandey, A Pyridazine compounds as JAK inhibitors US Patent  US9834548 Publication Date 12/5/2017 
Target
Name:
Tyrosine-protein kinase JAK3
Synonyms:
JAK-3 JAK3_HUMAN Janus kinase 3 (JAK3) L-JAK | Leukocyte janus kinase
Type:
Protein
Mol. Mass.:
125111.08
Organism:
Homo sapiens (Human)
Description:
P52333
Residue:
1124
  
Inhibitor
Name:
BDBM362235
Synonyms:
US9834548, Example 40
Type:
Small organic molecule
Emp. Form.:
C23H24F2N6O2
Mol. Mass.:
454.4725
SMILES:
Cc1cc(Nc2cc(NCc3cccc(F)c3F)c(nn2)C(N)=O)ccc1N1CCOCC1
: