Target
Tyrosine-protein kinase JAK2
Ligand
BDBM362238
Substrate
IC50
55±n/a nM
Citation
 Xu, QSong, YPandey, A Pyridazine compounds as JAK inhibitors US Patent  US9834548 Publication Date 12/5/2017 
Target
Name:
Tyrosine-protein kinase JAK2
Synonyms:
JAK-2 JAK2_HUMAN Janus kinase 2 (JAK2) | Janus kinase 2 (a protein tyrosine kinase)
Type:
Protein
Mol. Mass.:
130684.68
Organism:
Homo sapiens (Human)
Description:
O60674
Residue:
1132
  
Inhibitor
Name:
BDBM362238
Synonyms:
US9834548, Example 42
Type:
Small organic molecule
Emp. Form.:
C24H24F2N6O2
Mol. Mass.:
466.4832
SMILES:
Cc1cc(Nc2cc(NCc3cccc(F)c3F)c(nn2)C(N)=O)ccc1C(=O)N1CCCC1
: