Target
Tyrosine-protein kinase JAK3
Ligand
BDBM362278
Substrate
IC50
5.5±n/a nM
Citation
 Xu, QSong, YPandey, A Pyridazine compounds as JAK inhibitors US Patent  US9834548 Publication Date 12/5/2017 
Target
Name:
Tyrosine-protein kinase JAK3
Synonyms:
JAK-3 JAK3_HUMAN Janus kinase 3 (JAK3) L-JAK | Leukocyte janus kinase
Type:
Protein
Mol. Mass.:
125111.08
Organism:
Homo sapiens (Human)
Description:
P52333
Residue:
1124
  
Inhibitor
Name:
BDBM362278
Synonyms:
US9834548, Example 73
Type:
Small organic molecule
Emp. Form.:
C22H22FN7O2
Mol. Mass.:
435.4542
SMILES:
NC(=O)c1nnc(Nc2ccc(cn2)C(=O)N2CCCC2)cc1NCc1cccc(F)c1
: