Target
Tyrosine-protein kinase JAK3
Ligand
BDBM362292
Substrate
IC50
5.5±n/a nM
Citation
 Xu, QSong, YPandey, A Pyridazine compounds as JAK inhibitors US Patent  US9834548 Publication Date 12/5/2017 
Target
Name:
Tyrosine-protein kinase JAK3
Synonyms:
JAK-3 JAK3_HUMAN Janus kinase 3 (JAK3) L-JAK | Leukocyte janus kinase
Type:
Protein
Mol. Mass.:
125111.08
Organism:
Homo sapiens (Human)
Description:
P52333
Residue:
1124
  
Inhibitor
Name:
BDBM362292
Synonyms:
US9834548, Example 83
Type:
Small organic molecule
Emp. Form.:
C23H22F2N6O2
Mol. Mass.:
452.4566
SMILES:
NC(=O)c1nnc(Nc2ccc(cc2)C(=O)N2CCCC2)cc1NCc1cccc(F)c1F
: