Target
Tyrosine-protein kinase JAK2
Ligand
BDBM362308
Substrate
IC50
5.5±n/a nM
Citation
 Xu, QSong, YPandey, A Pyridazine compounds as JAK inhibitors US Patent  US9834548 Publication Date 12/5/2017 
Target
Name:
Tyrosine-protein kinase JAK2
Synonyms:
JAK-2 JAK2_HUMAN Janus kinase 2 (JAK2) | Janus kinase 2 (a protein tyrosine kinase)
Type:
Protein
Mol. Mass.:
130684.68
Organism:
Homo sapiens (Human)
Description:
O60674
Residue:
1132
  
Inhibitor
Name:
BDBM362308
Synonyms:
US9834548, Example 97
Type:
Small organic molecule
Emp. Form.:
C20H20N10O
Mol. Mass.:
416.4392
SMILES:
NC(=O)c1nnc(Nc2cnccn2)cc1NC1CCN(CC1)c1ccc(cn1)C#N
: