Target
Tyrosine-protein kinase JAK3
Ligand
BDBM362308
Substrate
IC50
5.5±n/a nM
Citation
 Xu, QSong, YPandey, A Pyridazine compounds as JAK inhibitors US Patent  US9834548 Publication Date 12/5/2017 
Target
Name:
Tyrosine-protein kinase JAK3
Synonyms:
JAK-3 JAK3_HUMAN Janus kinase 3 (JAK3) L-JAK | Leukocyte janus kinase
Type:
Protein
Mol. Mass.:
125111.08
Organism:
Homo sapiens (Human)
Description:
P52333
Residue:
1124
  
Inhibitor
Name:
BDBM362308
Synonyms:
US9834548, Example 97
Type:
Small organic molecule
Emp. Form.:
C20H20N10O
Mol. Mass.:
416.4392
SMILES:
NC(=O)c1nnc(Nc2cnccn2)cc1NC1CCN(CC1)c1ccc(cn1)C#N
: