Target
Tyrosine-protein kinase JAK3
Ligand
BDBM362311
Substrate
IC50
5.5±n/a nM
Citation
 Xu, QSong, YPandey, A Pyridazine compounds as JAK inhibitors US Patent  US9834548 Publication Date 12/5/2017 
Target
Name:
Tyrosine-protein kinase JAK3
Synonyms:
JAK-3 JAK3_HUMAN Janus kinase 3 (JAK3) L-JAK | Leukocyte janus kinase
Type:
Protein
Mol. Mass.:
125111.08
Organism:
Homo sapiens (Human)
Description:
P52333
Residue:
1124
  
Inhibitor
Name:
BDBM362311
Synonyms:
US9834548, Example 100
Type:
Small organic molecule
Emp. Form.:
C22H21N5O3S2
Mol. Mass.:
467.564
SMILES:
CS(=O)(=O)Cc1ccc(Nc2cc(NCc3cccc4ccsc34)c(nn2)C(N)=O)cc1
: