Target
Tyrosine-protein kinase JAK3
Ligand
BDBM362320
Substrate
IC50
<1±n/a nM
Citation
 Xu, QSong, YPandey, A Pyridazine compounds as JAK inhibitors US Patent  US9834548 Publication Date 12/5/2017 
Target
Name:
Tyrosine-protein kinase JAK3
Synonyms:
JAK-3 JAK3_HUMAN Janus kinase 3 (JAK3) L-JAK | Leukocyte janus kinase
Type:
Protein
Mol. Mass.:
125111.08
Organism:
Homo sapiens (Human)
Description:
P52333
Residue:
1124
  
Inhibitor
Name:
BDBM362320
Synonyms:
US9834548, Example 109
Type:
Small organic molecule
Emp. Form.:
C26H28N8O2
Mol. Mass.:
484.5529
SMILES:
CC(=O)N1CCN(CC1)c1ccc(Nc2cc(NCc3cccc4[nH]ccc34)c(nn2)C(N)=O)cc1
: