Target
Tyrosine-protein kinase JAK2
Ligand
BDBM362339
Substrate
IC50
55±n/a nM
Citation
 Xu, QSong, YPandey, A Pyridazine compounds as JAK inhibitors US Patent  US9834548 Publication Date 12/5/2017 
Target
Name:
Tyrosine-protein kinase JAK2
Synonyms:
JAK-2 JAK2_HUMAN Janus kinase 2 (JAK2) | Janus kinase 2 (a protein tyrosine kinase)
Type:
Protein
Mol. Mass.:
130684.68
Organism:
Homo sapiens (Human)
Description:
O60674
Residue:
1132
  
Inhibitor
Name:
BDBM362339
Synonyms:
US9834548, Example 128
Type:
Small organic molecule
Emp. Form.:
C26H30N8O2S
Mol. Mass.:
518.634
SMILES:
CCC(=O)N1CCC(Cn2cc(Nc3cc(NCc4cccc5ccsc45)c(nn3)C(N)=O)cn2)CC1
: