Target
Tyrosine-protein kinase JAK3
Ligand
BDBM362339
Substrate
IC50
5.5±n/a nM
Citation
 Xu, QSong, YPandey, A Pyridazine compounds as JAK inhibitors US Patent  US9834548 Publication Date 12/5/2017 
Target
Name:
Tyrosine-protein kinase JAK3
Synonyms:
JAK-3 JAK3_HUMAN Janus kinase 3 (JAK3) L-JAK | Leukocyte janus kinase
Type:
Protein
Mol. Mass.:
125111.08
Organism:
Homo sapiens (Human)
Description:
P52333
Residue:
1124
  
Inhibitor
Name:
BDBM362339
Synonyms:
US9834548, Example 128
Type:
Small organic molecule
Emp. Form.:
C26H30N8O2S
Mol. Mass.:
518.634
SMILES:
CCC(=O)N1CCC(Cn2cc(Nc3cc(NCc4cccc5ccsc45)c(nn3)C(N)=O)cn2)CC1
: