Target
Tyrosine-protein kinase JAK3
Ligand
BDBM362342
Substrate
IC50
55±n/a nM
Citation
 Xu, QSong, YPandey, A Pyridazine compounds as JAK inhibitors US Patent  US9834548 Publication Date 12/5/2017 
Target
Name:
Tyrosine-protein kinase JAK3
Synonyms:
JAK-3 JAK3_HUMAN Janus kinase 3 (JAK3) L-JAK | Leukocyte janus kinase
Type:
Protein
Mol. Mass.:
125111.08
Organism:
Homo sapiens (Human)
Description:
P52333
Residue:
1124
  
Inhibitor
Name:
BDBM362342
Synonyms:
US9834548, Example 131
Type:
Small organic molecule
Emp. Form.:
C21H22N8O2S
Mol. Mass.:
450.517
SMILES:
CN(C)C(=O)Cn1cc(Nc2cc(NCc3cccc4ccsc34)c(nn2)C(N)=O)cn1
: