Target
Tyrosine-protein kinase JAK3
Ligand
BDBM362344
Substrate
IC50
5.5±n/a nM
Citation
 Xu, QSong, YPandey, A Pyridazine compounds as JAK inhibitors US Patent  US9834548 Publication Date 12/5/2017 
Target
Name:
Tyrosine-protein kinase JAK3
Synonyms:
JAK-3 JAK3_HUMAN Janus kinase 3 (JAK3) L-JAK | Leukocyte janus kinase
Type:
Protein
Mol. Mass.:
125111.08
Organism:
Homo sapiens (Human)
Description:
P52333
Residue:
1124
  
Inhibitor
Name:
BDBM362344
Synonyms:
US9834548, Example 133
Type:
Small organic molecule
Emp. Form.:
C24H29F2N9O2
Mol. Mass.:
513.543
SMILES:
CN(C)C(=O)N1CCC(Cn2cc(Nc3cc(NCc4cccc(F)c4F)c(nn3)C(N)=O)cn2)CC1
: