Target
Orexin receptor type 2
Ligand
BDBM143749
Substrate
Meas. Tech.
Receptor Radioligand Binding Assay
Ki
526±n/a nM
Citation
 Gelin, CFLebold, TPShireman, BT Substituted 2-azabicycles and their use as orexin receptor modulators US Patent  US9845333 Publication Date 12/19/2017 
Target
Name:
Orexin receptor type 2
Synonyms:
Hcrtr2 OX2R_RAT Orexin receptor type 2 (OX2) Ox-2-R Ox2R
Type:
Protein
Mol. Mass.:
52508.46
Organism:
Rattus norvegicus (Rat)
Description:
P56719
Residue:
460
  
Inhibitor
Name:
BDBM143749
Synonyms:
US10183953, Example 10 US9611277, Example 10 | US9845333, 10
Type:
Small organic molecule
Emp. Form.:
C24H22F3N3O3
Mol. Mass.:
457.445
SMILES:
CCOc1ccc2cccnc2c1C(=O)N1CC2CC(Oc3ccc(cn3)C(F)(F)F)C1C2
: