Target
Oxysterols receptor LXR-beta [154-461]
Ligand
BDBM20000
Substrate
BDBM19993
Meas. Tech.
LXR Binding Assay and hLXR beta Reporter Assay
pH
7.4±n/a
Temperature
277.15±n/a K
IC50
2.1±0.4 nM
EC50
71±21 nM
Comments
Efficacy=97 +/- 10% in transfected hLXRbeta reporter cell line assay.
Citation
 Hu, BCollini, MUnwalla, RMiller, CSinghaus, RQuinet, ESavio, DHalpern, ABasso, MKeith, JClerin, VChen, LResmini, CLiu, QYFeingold, IHuselton, CAzam, FFarnegardh, MEnroth, CBonn, TGoos-Nilsson, AWilhelmsson, ANambi, PWrobel, J Discovery of phenyl acetic acid substituted quinolines as novel liver X receptor agonists for the treatment of atherosclerosis. J Med Chem 49:6151-4 (2006)  
Target
Name:
Oxysterols receptor LXR-beta [154-461]
Synonyms:
LXRB NER NR1H2_HUMAN Nuclear receptor NER Oxysterols receptor LXR-beta Ubiquitously-expressed nuclear receptor
Type:
Receptor
Mol. Mass.:
34695.52
Organism:
Homo sapiens (Human)
Description:
LXR beta ligand binding domain (amino acid residues 154-461) with an N-terminal biotinylation tag expressed in E.coli, was used for the binding assays.
Residue:
308
  
Inhibitor
Name:
BDBM20000
Synonyms:
2-(4-{3-[3-benzyl-8-(trifluoromethyl)quinolin-4-yl]phenoxymethyl}phenyl)acetic acid JMC496151 Compound 15 | WAY-254011
Type:
Small organic molecule
Emp. Form.:
C32H24F3NO3
Mol. Mass.:
527.5331
SMILES:
OC(=O)Cc1ccc(COc2cccc(c2)-c2c(Cc3ccccc3)cnc3c(cccc23)C(F)(F)F)cc1
:
Substrate
Name:
BDBM19993
Synonyms:
CHEMBL62136 T 0901317 TO-901317 US10669296, Compound TO901317 [3H]T0901317
Type:
Small organic molecule
Emp. Form.:
C17H12F9NO3S
Mol. Mass.:
481.333
SMILES:
OC(c1ccc(cc1)N(CC(F)(F)F)S(=O)(=O)c1ccccc1)(C(F)(F)F)C(F)(F)F
: