Target
Oxysterols receptor LXR-alpha
Ligand
BDBM19992
Substrate
biotinylated SRC-1 peptide
Meas. Tech.
Fluorescence-Resonance Energy Transfer Assay
pH
7.2±n/a
Temperature
310.15±n/a K
EC50
97±n/a nM
Comments
FRET LXRalpha, efficacy = 100 %. 100% induction of ABCA1 gene activity in human THP-1 cells @ 1uM.
Citation
 Molteni, VLi, XNabakka, JLiang, FWityak, JKoder, AVargas, LRomeo, RMitro, NMak, PASeidel, HMHaslam, JAChow, DTuntland, TSpalding, TABrock, ABradley, MCastrillo, ATontonoz, PSaez, E N-Acylthiadiazolines, a new class of liver X receptor agonists with selectivity for LXRbeta. J Med Chem 50:4255-9 (2007)  
Target
Name:
Oxysterols receptor LXR-alpha
Synonyms:
LXRA Liver X receptor alpha Liver X receptor alpha (NR1H3) NR1H3 Nuclear orphan receptor LXR-alpha | Nuclear receptor subfamily 1 group H member 3
Type:
Enzyme Catalytic Domain
Mol. Mass.:
50403.85
Organism:
Homo sapiens (Human)
Description:
Q13133
Residue:
447
  
Inhibitor
Name:
BDBM19992
Synonyms:
2-[3-[3-[[2-chloro-3-(trifluoromethyl)phenyl]methyl-[2,2-di(phenyl)ethyl]amino]propoxy]phenyl]acetic acid CHEMBL59030 GW3965 US10669296, Compound GW3965 | US10945978, Compound 2
Type:
Small organic molecule
Emp. Form.:
C33H31ClF3NO3
Mol. Mass.:
582.052
SMILES:
OC(=O)Cc1cccc(OCCCN(CC(c2ccccc2)c2ccccc2)Cc2cccc(c2Cl)C(F)(F)F)c1
:
Substrate
Name:
biotinylated SRC-1 peptide
Synonyms:
Type:
Peptide
Mol. Mass.:
2905.78
Organism:
Description:
Residue:
26