Target
Oxysterols receptor LXR-alpha
Ligand
BDBM20141
Substrate
biotinylated SRC-1 peptide
Meas. Tech.
Fluorescence-Resonance Energy Transfer Assay
pH
7.2±n/a
Temperature
310.15±n/a K
EC50
1500±n/a nM
Comments
Efficacy = 30 % in FRET LXRalpha assay. There was 27% induction of ABCA1 gene activity in human THP-1 cells @ 1uM.
Citation
 Molteni, VLi, XNabakka, JLiang, FWityak, JKoder, AVargas, LRomeo, RMitro, NMak, PASeidel, HMHaslam, JAChow, DTuntland, TSpalding, TABrock, ABradley, MCastrillo, ATontonoz, PSaez, E N-Acylthiadiazolines, a new class of liver X receptor agonists with selectivity for LXRbeta. J Med Chem 50:4255-9 (2007)  
Target
Name:
Oxysterols receptor LXR-alpha
Synonyms:
LXRA Liver X receptor alpha Liver X receptor alpha (NR1H3) NR1H3 Nuclear orphan receptor LXR-alpha | Nuclear receptor subfamily 1 group H member 3
Type:
Enzyme Catalytic Domain
Mol. Mass.:
50403.85
Organism:
Homo sapiens (Human)
Description:
Q13133
Residue:
447
  
Inhibitor
Name:
BDBM20141
Synonyms:
5-(3,4-difluorophenyl)-2-(2,3-dimethoxyphenyl)-3-[(3-fluorophenyl)carbonyl]-2,3-dihydro-1,3,4-thiadiazole | N-Acylthiadiazoline, 21
Type:
Small organic molecule
Emp. Form.:
C23H17F3N2O3S
Mol. Mass.:
458.453
SMILES:
COc1cccc(C2SC(=NN2C(=O)c2cccc(F)c2)c2ccc(F)c(F)c2)c1OC
:
Substrate
Name:
biotinylated SRC-1 peptide
Synonyms:
Type:
Peptide
Mol. Mass.:
2905.78
Organism:
Description:
Residue:
26