Target
Tyrosine-protein kinase SYK
Ligand
BDBM100349
Substrate
Meas. Tech.
In Vitro Assay
IC50
55±n/a nM
Citation
 Bauer, SMPandey, A Inhibitors of protein kinases US Patent  US9868729 Publication Date 1/16/2018 
Target
Name:
Tyrosine-protein kinase SYK
Synonyms:
KSYK_HUMAN Spleen Tyrosine Kinase Tyrosine-protein kinase SYK (Syk)
Type:
Enzyme
Mol. Mass.:
72079.99
Organism:
Homo sapiens (Human)
Description:
P43405
Residue:
635
  
Inhibitor
Name:
BDBM100349
Synonyms:
US10533001, Example Table 9a.2 US8501944, 371 | US9868729, Example 207
Type:
Small organic molecule
Emp. Form.:
C21H27N7O2
Mol. Mass.:
409.4848
SMILES:
CNC(=O)[C@H]1CCCN(C1)c1ccc(Nc2ncc(C(N)=O)c(NC3CC3)n2)cc1
: