Target
Diacylglycerol kinase zeta
Ligand
BDBM615798
Substrate
Meas. Tech.
DGKalpha and DGKzeta Biochemical Assays
IC50
<10±n/a nM
Citation
 Casarez, AKellar, T COMPOUNDS USEFUL AS T CELL ACTIVATORS US Patent  US20230271954 Publication Date 8/31/2023 
Target
Name:
Diacylglycerol kinase zeta
Synonyms:
2.7.1.107 DAGK6 DGKZ Diacylglycerol kinase zeta | Diglyceride kinase zeta
Type:
PROTEIN
Mol. Mass.:
124177.85
Organism:
Homo sapiens
Description:
ChEMBL_117547
Residue:
1117
  
Inhibitor
Name:
BDBM615798
Synonyms:
US20230271954, Compound 97 | cis-8-4-(benzo[d][1,3]dioxol-5-yl(cyclobutylmethyl) amino)cyclohexyl)(methyl)amino)-5-methyl-6-oxo- 5,6-dihydro-1,5-naphthyridine-2,7-dicarbonitrile
Type:
Small organic molecule
Emp. Form.:
C30H32N6O3
Mol. Mass.:
524.6135
SMILES:
CN([C@H]1CCC(CC1)N(CC1CCC1)c1ccc2OCOc2c1)c1c(C#N)c(=O)n(C)c2ccc(nc12)C#N
: