Target
Diacylglycerol kinase zeta
Ligand
BDBM615803
Substrate
Meas. Tech.
DGKalpha and DGKzeta Biochemical Assays
IC50
<10±n/a nM
Citation
 Casarez, AKellar, T COMPOUNDS USEFUL AS T CELL ACTIVATORS US Patent  US20230271954 Publication Date 8/31/2023 
Target
Name:
Diacylglycerol kinase zeta
Synonyms:
2.7.1.107 DAGK6 DGKZ Diacylglycerol kinase zeta | Diglyceride kinase zeta
Type:
PROTEIN
Mol. Mass.:
124177.85
Organism:
Homo sapiens
Description:
ChEMBL_117547
Residue:
1117
  
Inhibitor
Name:
BDBM615803
Synonyms:
US20230271954, Compound 102 | cis-8-4-((cyclopropylmethyl)(3,5-dimethoxyphenyl) amino)cyclohexyl)(methyl)amino)-5-methyl-6-oxo- 5,6-dihydro-1,5-naphthyridine-2,7-dicarbonitrile
Type:
Small organic molecule
Emp. Form.:
C30H34N6O3
Mol. Mass.:
526.6294
SMILES:
COc1cc(OC)cc(c1)N(CC1CC1)C1CC[C@@H](CC1)N(C)c1c(C#N)c(=O)n(C)c2ccc(nc12)C#N
: