Target
Diacylglycerol kinase zeta
Ligand
BDBM615864
Substrate
Meas. Tech.
DGKalpha and DGKzeta Biochemical Assays
IC50
<10±n/a nM
Citation
 Casarez, AKellar, T COMPOUNDS USEFUL AS T CELL ACTIVATORS US Patent  US20230271954 Publication Date 8/31/2023 
Target
Name:
Diacylglycerol kinase zeta
Synonyms:
2.7.1.107 DAGK6 DGKZ Diacylglycerol kinase zeta | Diglyceride kinase zeta
Type:
PROTEIN
Mol. Mass.:
124177.85
Organism:
Homo sapiens
Description:
ChEMBL_117547
Residue:
1117
  
Inhibitor
Name:
BDBM615864
Synonyms:
US20230271954, Compound 163 | cis-8-((-4-(((1,4-dioxan-2-yl)methyl)(4-fluorophenyl) amino)cyclohexyl)(methyl)amino)-5-methyl-6-oxo- 5,6-dihydro-1,5-naphthyridine-2-carbonitrile
Type:
Small organic molecule
Emp. Form.:
C28H32FN5O3
Mol. Mass.:
505.5838
SMILES:
CN(C1CC[C@@H](CC1)N(CC1COCCO1)c1ccc(F)cc1)c1cc(=O)n(C)c2ccc(nc12)C#N
: