Target
Amyloid-beta precursor protein
Ligand
BDBM50393104
Substrate
Meas. Tech.
sAPPbeta Release Assay
IC50
0.720±n/a nM
Citation
 Csjernyik, GKarlstrom, SKers, AKolmodin, KNylof, MOhberg, LRakos, LSandberg, LSehgelmeble, FSoderman, PSwahn, BVon Berg, S Compounds and their use as BACE inhibitors US Patent  US10231967 Publication Date 3/19/2019 
Target
Name:
Amyloid-beta precursor protein
Synonyms:
A4 ABPP AICD-50 AICD-59 AID(57) APP Alzheimer disease amyloid protein Amyloid beta Protein Amyloid beta protein Abeta(1-42) Amyloid intracellular domain 57 Amyloid protein (Abeta42b) Beta amyloid A4 protein Beta-APP42 Beta-amyloid protein 42 C83 CVAP Gamma Secretase Gamma-CTF(57) Gamma-secretase Gamma-secretase C-terminal fragment 57 P3(40) PN-II Protease nexin-II S-APP-beta Soluble APP-beta | beta-Amyloid Precursor Protein (APP)
Type:
Single-pass type I membrane protein
Mol. Mass.:
86890.41
Organism:
Homo sapiens (Human)
Description:
P05067
Residue:
770
  
Inhibitor
Name:
BDBM50393104
Synonyms:
CHEMBL2152918 US9918985, Example 20aa
Type:
Small organic molecule
Emp. Form.:
C23H25BrN4O
Mol. Mass.:
453.375
SMILES:
CO[C@H]1CC[C@@]2(Cc3ccc(cc3C22N=C(C)C(N)=N2)-c2cncc(Br)c2)CC1
: