Target
Proto-oncogene tyrosine-protein kinase receptor Ret
Ligand
BDBM370368
Substrate
Meas. Tech.
Measurement of RET Inhibitory Activity
IC50
0.590±n/a nM
Citation
 Miyazaki, IShimamura, TKato, MFujita, H Fused pyrimidine compound or salt thereof US Patent  US10233189 Publication Date 3/19/2019 
Target
Name:
Proto-oncogene tyrosine-protein kinase receptor Ret
Synonyms:
CDHF12 Cadherin family member 12 Proto-oncogene c-Ret RET51 Tyrosine-protein kinase Ret (RET)
Type:
Protein
Mol. Mass.:
124318.29
Organism:
Homo sapiens (Human)
Description:
P07949
Residue:
1114
  
Inhibitor
Name:
BDBM370368
Synonyms:
US10233189, Example 47 US11014930, Example 47 | US11236096, Example 47
Type:
Small organic molecule
Emp. Form.:
C19H25N7O
Mol. Mass.:
367.4481
SMILES:
Cc1cc(NC(=O)c2cn(C3CCC(C)(C)CC3)c3ncnc(N)c23)n[nH]1
: