Target
Mitogen-activated protein kinase 14
Ligand
BDBM161376
Substrate
Meas. Tech.
p38 MAPKalpha Enzyme Inhibition
Kd
20.0±n/a nM
Citation
 Ito, KCharron, CEKing-Underwood, JOnions, STLongshaw, AI 1-pyrazolyl-3-(4-((2-anilinopyrimidin-4-yl) oxy) napththalen-1-yl) ureas as p38 MAP kinase inhibitors US Patent  US10238658 Publication Date 3/26/2019 
Target
Name:
Mitogen-activated protein kinase 14
Synonyms:
CSAID-binding protein CSBP1 CSPB1 MAP kinase 14 MAP kinase p38 alpha MAPK14 MK14_HUMAN Mitogen-activated protein kinase p38 alpha Stress-activated protein kinase 2a | p38 MAP kinase alpha/beta
Type:
Serine/threonine-protein kinase
Mol. Mass.:
41286.76
Organism:
Homo sapiens (Human)
Description:
Q16539
Residue:
360
  
Inhibitor
Name:
BDBM161376
Synonyms:
US10238658, Example 1 US9108950, 1 US9993478, Example 1
Type:
Small organic molecule
Emp. Form.:
C35H33N7O2
Mol. Mass.:
583.6822
SMILES:
Cc1ccc(cc1)-n1nc(cc1NC(=O)Nc1ccc(Oc2ccnc(Nc3ccccc3)n2)c2ccccc12)C(C)(C)C
: