Target
ADP-ribosylhydrolase ARH3
Ligand
BDBM371204
Substrate
Meas. Tech.
ARH3 Assay
IC50
>150000±n/a nM
Citation
 McGonagle, AEJordan, AWaszkowycz, BHutton, CWaddell, IHitchin, JRSmith, KMHamilton, NM 2,4-dioxo-quinazoline-6-sulfonamide derivatives as inhibitors of PARG US Patent  US10239843 Publication Date 3/26/2019 
Target
Name:
ADP-ribosylhydrolase ARH3
Synonyms:
ADP-ribose glycohydrolase ARH3 ADPRHL2 ADPRS_HUMAN O-acetyl-ADP-ribose deacetylase ARH3 [Protein ADP-ribosylarginine] hydrolase-like protein 2 | [Protein ADP-ribosylserine] hydrolase
Type:
Enzyme Catalytic Domain
Mol. Mass.:
38934.22
Organism:
Homo sapiens (Human)
Description:
Q9NX46
Residue:
363
  
Inhibitor
Name:
BDBM371204
Synonyms:
4-(Cyclopropanecarbonyl)-N-(1-methylcyclopropyl)-2-[(3-methylisoxazol-5-yl)methyl]-1-oxo-isoquinoline-7-sulfonamide | US10239843, Example 311
Type:
Small organic molecule
Emp. Form.:
C22H23N3O5S
Mol. Mass.:
441.5
SMILES:
Cc1cc(Cn2cc(C(=O)C3CC3)c3ccc(cc3c2=O)S(=O)(=O)NC2(C)CC2)on1
: