Target
Voltage-dependent T-type calcium channel subunit alpha-1H
Ligand
BDBM372456
Substrate
Meas. Tech.
Measurement of Calcium Channel Flux by Means of FLIPR Assay
IC50
23.0±n/a nM
Citation
 Bezencon, OGatfield, JHeidmann, BSiegrist, RStamm, S Triazole compounds as T-type calcium channel blockers US Patent  US10246426 Publication Date 4/2/2019 
Target
Name:
Voltage-dependent T-type calcium channel subunit alpha-1H
Synonyms:
CAC1H_HUMAN Low-voltage-activated calcium channel alpha1 3.2 subunit Voltage-gated calcium channel voltage-dependent T-type calcium channel subunit alpha-1H isoform a
Type:
Enzyme Catalytic Domain
Mol. Mass.:
259187.68
Organism:
Homo sapiens (Human)
Description:
Calcium channel (Type T,L) 0 0::O95180
Residue:
2353
  
Inhibitor
Name:
BDBM372456
Synonyms:
2-(4-Cyclopropoxy-phenyl)-N-[2-(3,4-difluoro-benzyl)-2H-[1,2,3]triazol-4-yl]-acetamide | US10246426, Example 10
Type:
Small organic molecule
Emp. Form.:
C20H18F2N4O2
Mol. Mass.:
384.3793
SMILES:
Fc1ccc(Cn2ncc(NC(=O)Cc3ccc(OC4CC4)cc3)n2)cc1F
: