Target
Voltage-dependent T-type calcium channel subunit alpha-1H
Ligand
BDBM372462
Substrate
Meas. Tech.
Measurement of Calcium Channel Flux by Means of FLIPR Assay
IC50
15.0±n/a nM
Citation
 Bezencon, OGatfield, JHeidmann, BSiegrist, RStamm, S Triazole compounds as T-type calcium channel blockers US Patent  US10246426 Publication Date 4/2/2019 
Target
Name:
Voltage-dependent T-type calcium channel subunit alpha-1H
Synonyms:
CAC1H_HUMAN Low-voltage-activated calcium channel alpha1 3.2 subunit Voltage-gated calcium channel voltage-dependent T-type calcium channel subunit alpha-1H isoform a
Type:
Enzyme Catalytic Domain
Mol. Mass.:
259187.68
Organism:
Homo sapiens (Human)
Description:
Calcium channel (Type T,L) 0 0::O95180
Residue:
2353
  
Inhibitor
Name:
BDBM372462
Synonyms:
2-(6-Diethylamino-pyridin-3-yl)-N-[2-(3,4-difluoro-benzyl)-2H-[1,2,3]triazol-4-yl]-acetamide | US10246426, Example 16
Type:
Small organic molecule
Emp. Form.:
C20H22F2N6O
Mol. Mass.:
400.4251
SMILES:
CCN(CC)c1ccc(CC(=O)Nc2cnn(Cc3ccc(F)c(F)c3)n2)cn1
: