Target
Voltage-dependent T-type calcium channel subunit alpha-1H
Ligand
BDBM372513
Substrate
Meas. Tech.
Measurement of Calcium Channel Flux by Means of FLIPR Assay
IC50
20.0±n/a nM
Citation
 Bezencon, OGatfield, JHeidmann, BSiegrist, RStamm, S Triazole compounds as T-type calcium channel blockers US Patent  US10246426 Publication Date 4/2/2019 
Target
Name:
Voltage-dependent T-type calcium channel subunit alpha-1H
Synonyms:
CAC1H_HUMAN Low-voltage-activated calcium channel alpha1 3.2 subunit Voltage-gated calcium channel voltage-dependent T-type calcium channel subunit alpha-1H isoform a
Type:
Enzyme Catalytic Domain
Mol. Mass.:
259187.68
Organism:
Homo sapiens (Human)
Description:
Calcium channel (Type T,L) 0 0::O95180
Residue:
2353
  
Inhibitor
Name:
BDBM372513
Synonyms:
N-[2-(4-Methyl-benzyl)-2H-[1,2,3]triazol-4-yl]-2-(1-methyl-1H-indazol-5-yl)-acetamide | US10246426, Example 69
Type:
Small organic molecule
Emp. Form.:
C20H20N6O
Mol. Mass.:
360.4124
SMILES:
Cc1ccc(Cn2ncc(NC(=O)Cc3ccc4n(C)ncc4c3)n2)cc1
: