Target
Voltage-dependent T-type calcium channel subunit alpha-1H
Ligand
BDBM372535
Substrate
Meas. Tech.
Measurement of Calcium Channel Flux by Means of FLIPR Assay
IC50
15.0±n/a nM
Citation
 Bezencon, OGatfield, JHeidmann, BSiegrist, RStamm, S Triazole compounds as T-type calcium channel blockers US Patent  US10246426 Publication Date 4/2/2019 
Target
Name:
Voltage-dependent T-type calcium channel subunit alpha-1H
Synonyms:
CAC1H_HUMAN Low-voltage-activated calcium channel alpha1 3.2 subunit Voltage-gated calcium channel voltage-dependent T-type calcium channel subunit alpha-1H isoform a
Type:
Enzyme Catalytic Domain
Mol. Mass.:
259187.68
Organism:
Homo sapiens (Human)
Description:
Calcium channel (Type T,L) 0 0::O95180
Residue:
2353
  
Inhibitor
Name:
BDBM372535
Synonyms:
2-[4-(3-Methyl-oxetan-3-yl)-phenyl]-N-[2-(4-trifluoromethoxy-benzyl)-2H-[1,2,3]triazol-4-yl]-acetamide | US10246426, Example 93
Type:
Small organic molecule
Emp. Form.:
C22H21F3N4O3
Mol. Mass.:
446.4223
SMILES:
CC1(COC1)c1ccc(CC(=O)Nc2cnn(Cc3ccc(OC(F)(F)F)cc3)n2)cc1
: