Target
Voltage-dependent T-type calcium channel subunit alpha-1H
Ligand
BDBM372591
Substrate
Meas. Tech.
Measurement of Calcium Channel Flux by Means of FLIPR Assay
IC50
16.0±n/a nM
Citation
 Bezencon, OGatfield, JHeidmann, BSiegrist, RStamm, S Triazole compounds as T-type calcium channel blockers US Patent  US10246426 Publication Date 4/2/2019 
Target
Name:
Voltage-dependent T-type calcium channel subunit alpha-1H
Synonyms:
CAC1H_HUMAN Low-voltage-activated calcium channel alpha1 3.2 subunit Voltage-gated calcium channel voltage-dependent T-type calcium channel subunit alpha-1H isoform a
Type:
Enzyme Catalytic Domain
Mol. Mass.:
259187.68
Organism:
Homo sapiens (Human)
Description:
Calcium channel (Type T,L) 0 0::O95180
Residue:
2353
  
Inhibitor
Name:
BDBM372591
Synonyms:
N-[2-(3,5-Difluoro-4-methoxy-benzyl)-2H-[1,2,3]triazol-4-yl]-2-(1,3-dimethyl-1H-indol-5-yl)-acetamide | US10246426, Example 150
Type:
Small organic molecule
Emp. Form.:
C22H21F2N5O2
Mol. Mass.:
425.4312
SMILES:
COc1c(F)cc(Cn2ncc(NC(=O)Cc3ccc4n(C)cc(C)c4c3)n2)cc1F
: