Target
Botulinum neurotoxin type A2 [1-425]
Ligand
BDBM23263
Substrate
SNAPtide
Meas. Tech.
Evaluation of Inhibitors with Recombinant LC/A
pH
7.4±n/a
Temperature
296.15±n/a K
IC50
54200±n/a nM
Citation
 Eubanks, LMHixon, MSJin, WHong, SClancy, CMTepp, WHBaldwin, MRMalizio, CJGoodnough, MCBarbieri, JTJohnson, EABoger, DLDickerson, TJJanda, KD An in vitro and in vivo disconnect uncovered through high-throughput identification of botulinum neurotoxin A antagonists. Proc Natl Acad Sci U S A 104:2602-7 (2007)  
Target
Name:
Botulinum neurotoxin type A2 [1-425]
Synonyms:
BXA2_CLOBJ Botulinum Neurotoxin Type A atx bonT botA
Type:
Metalloprotease
Mol. Mass.:
48687.43
Organism:
Clostridium botulinum
Description:
Recombinant C. botulinum LC/A (1-425) was expressed in E. coli.
Residue:
425
  
Inhibitor
Name:
BDBM23263
Synonyms:
(3R,4R)-3-N-(diphenylmethyl)-1-{[4-(4-{[(3S,4S)-3-[(diphenylmethyl)carbamoyl]-4-[(2-phenylethyl)carbamoyl]pyrrolidin-1-yl]carbonyl}phenyl)phenyl]carbonyl}-4-N-(2-phenylethyl)pyrrolidine-3,4-dicarboxamide | TransPyr1-A1B6C6
Type:
Small organic molecule
Emp. Form.:
C68H64N6O6
Mol. Mass.:
1061.2724
SMILES:
O=C(NCCc1ccccc1)[C@H]1CN(C[C@@H]1C(=O)NC(c1ccccc1)c1ccccc1)C(=O)c1ccc(cc1)-c1ccc(cc1)C(=O)N1C[C@H]([C@@H](C1)C(=O)NC(c1ccccc1)c1ccccc1)C(=O)NCCc1ccccc1
:
Substrate
Name:
SNAPtide
Synonyms:
Type:
Fluorogenic Substrate
Mol. Mass.:
358.43
Organism:
Description:
Peptide derived from synaptosomes associated protein, SNAP-25. (U.S. Patent #6504006. List Biological Laboratories, Inc., Campbell, CA.).
Residue:
3
NA