Target
Botulinum neurotoxin type A2 [1-425]
Ligand
BDBM23267
Substrate
SNAPtide
Meas. Tech.
Evaluation of Inhibitors with Recombinant LC/A
pH
7.4±n/a
Temperature
295.65±n/a K
IC50
40000±5000 nM
Citation
 Boldt, GEKennedy, JPJanda, KD Identification of a potent botulinum neurotoxin a protease inhibitor using in situ lead identification chemistry. Org Lett 8:1729-32 (2006)  
Target
Name:
Botulinum neurotoxin type A2 [1-425]
Synonyms:
BXA2_CLOBJ Botulinum Neurotoxin Type A atx bonT botA
Type:
Metalloprotease
Mol. Mass.:
48687.43
Organism:
Clostridium botulinum
Description:
Recombinant C. botulinum LC/A (1-425) was expressed in E. coli.
Residue:
425
  
Inhibitor
Name:
BDBM23267
Synonyms:
(2E)-3-(4-bromophenyl)-N-hydroxyprop-2-enamide | Cinnamic hydroxamate deriv., 11
Type:
Small organic molecule
Emp. Form.:
C9H8BrNO2
Mol. Mass.:
242.069
SMILES:
ONC(=O)\C=C\c1ccc(Br)cc1
:
Substrate
Name:
SNAPtide
Synonyms:
Type:
Fluorogenic Substrate
Mol. Mass.:
358.43
Organism:
Description:
Peptide derived from synaptosomes associated protein, SNAP-25. (U.S. Patent #6504006. List Biological Laboratories, Inc., Campbell, CA.).
Residue:
3
NA