Target
Botulinum neurotoxin type A2 [1-425]
Ligand
BDBM23284
Substrate
SNAPtide
Meas. Tech.
Evaluation of Inhibitors with Recombinant LC/A
pH
7.4±n/a
Temperature
296.15±n/a K
IC50
4400±100 nM
Citation
 Capková, KYoneda, YDickerson, TJJanda, KD Synthesis and structure-activity relationships of second-generation hydroxamate botulinum neurotoxin A protease inhibitors. Bioorg Med Chem Lett 17:6463-6 (2007)  
Target
Name:
Botulinum neurotoxin type A2 [1-425]
Synonyms:
BXA2_CLOBJ Botulinum Neurotoxin Type A atx bonT botA
Type:
Metalloprotease
Mol. Mass.:
48687.43
Organism:
Clostridium botulinum
Description:
Recombinant C. botulinum LC/A (1-425) was expressed in E. coli.
Residue:
425
  
Inhibitor
Name:
BDBM23284
Synonyms:
(2E)-3-(4-chloro-2-fluorophenyl)-N-hydroxyprop-2-enamide | hydroxamate derivative, 5a
Type:
Small organic molecule
Emp. Form.:
C9H7ClFNO2
Mol. Mass.:
215.609
SMILES:
ONC(=O)\C=C\c1ccc(Cl)cc1F
:
Substrate
Name:
SNAPtide
Synonyms:
Type:
Fluorogenic Substrate
Mol. Mass.:
358.43
Organism:
Description:
Peptide derived from synaptosomes associated protein, SNAP-25. (U.S. Patent #6504006. List Biological Laboratories, Inc., Campbell, CA.).
Residue:
3
NA